0
을 사용하여 this post을 반환합니다."sudo make"는 오류 memcache 설정
나는 libmemcache-(STABLE)을 설치 한 후 ./configure
에 수 있었지만 지금은 다음 설정으로 이동하고 내가 할 sudo make
을 실행할 때 다음과 같은 : 무엇이 잘못되었는지
Making all in src
make[1]: Entering directory `/root/tmp/memcached_functions_mysql-1.1/src'
make all-am
make[2]: Entering directory `/root/tmp/memcached_functions_mysql-1.1/src'
/bin/sh ../libtool --preserve-dup-deps --tag=CC --mode=compile gcc -DHAVE_CONFIG_H -I. -I../include -I/usr/include/mysql -g -pipe -Wp,-D_FORTIFY_SOURCE=2 -fexceptions -fstack-protector --param=ssp-buffer-size=4 -m64 -D_GNU_SOURCE -D_FILE_OFFSET_BITS=64 -D_LARGEFILE_SOURCE -fno-strict-aliasing -fwrapv -g -O2 -MT args.lo -MD -MP -MF .deps/args.Tpo -c -o args.lo args.c
gcc -DHAVE_CONFIG_H -I. -I../include -I/usr/include/mysql -g -pipe -Wp,-D_FORTIFY_SOURCE=2 -fexceptions -fstack-protector --param=ssp-buffer-size=4 -m64 -D_GNU_SOURCE -D_FILE_OFFSET_BITS=64 -D_LARGEFILE_SOURCE -fno-strict-aliasing -fwrapv -g -O2 -MT args.lo -MD -MP -MF .deps/args.Tpo -c args.c -fPIC -DPIC -o .libs/args.o
args.c:7:19: error: mysql.h: No such file or directory
In file included from args.c:12:
common.h:19: error: expected ')' before '*' token
args.c:16: error: expected ')' before '*' token
args.c:82: error: expected ')' before '*' token
make[2]: *** [args.lo] Error 1
make[2]: Leaving directory `/root/tmp/memcached_functions_mysql-1.1/src'
make[1]: *** [all] Error 2
make[1]: Leaving directory `/root/tmp/memcached_functions_mysql-1.1/src'
make: *** [all-recursive] Error 1
어떤 아이디어?
감사
예. 다시 한 번 감사드립니다! – Hayden
나는 그것을 시험해 보았다. 나는 받아들이 기 위해 7 분을 기다려야한다고 말했다. 이제 'plugin_dir'과 같은 plugin_dir 쇼 변수를 찾을 수 없습니다. 빈 위치를 반환합니다 – Hayden
다른 스레드를 시작합니다. – Hayden